{"text_format":"1","workbook":"xlsx","n_sheets":4,"sheets":["Finding the Right Cover Crop","Cover Crop Data","Reference Links","Sheet3"],"not_rendered":{"charts":0,"images":0,"macros":1,"external_links":1,"defined_names":8,"comments":0,"pivot_tables":0},"unopened":[],"bounds":{"document_bytes":16777216,"sheet_cells":100000,"rows_first":2000,"rows_last":500,"rows_between":2000,"halvings":0,"cell_chars":16384,"cell_head_chars":4096},"cells_cut":0,"cells_raw":0,"read":"whole","date_system":"1900"}

{"sheet":"Finding the Right Cover Crop","index":0,"n_rows":71,"n_cols":13,"rows_kept":71,"cut":false,"hidden":false,"merged":[[38,2,38,3],[39,2,39,3],[41,4,41,5],[0,0,0,9],[13,1,13,4],[19,1,19,4],[15,1,15,3],[17,6,17,9],[7,1,7,3],[9,1,9,3],[11,1,11,3],[4,2,4,3],[4,5,4,6],[25,1,25,4],[33,7,33,10],[21,5,21,6],[23,5,23,6],[21,7,21,10],[23,7,23,10],[37,2,37,3],[33,1,33,3],[29,5,29,6],[31,1,31,3],[31,5,31,6],[25,5,25,6],[27,1,27,3],[27,5,27,6],[25,7,25,10],[33,5,33,6],[44,1,44,2],[44,3,44,9],[45,3,45,9],[50,1,51,1],[49,4,49,5],[51,9,51,10],[49,9,49,10],[50,9,50,10],[50,6,51,6],[45,1,45,2],[50,4,50,5],[49,2,49,3],[50,2,50,3],[48,1,48,10],[46,1,47,10],[35,12,37,14],[4,0,4,1],[6,5,7,5],[50,8,51,8],[49,7,51,7],[41,6,41,10],[37,4,37,5],[37,7,37,8],[38,4,38,5],[39,4,39,5],[38,7,38,8],[40,4,40,5],[13,6,13,10],[35,0,35,10],[23,1,23,4],[21,1,21,4]]}
["Finding the Right Cover Crop for Your Row Crop Landowner"]
[]
["Instructions:  Cream color cells require you to fill in.  Blue cells are drop down menus.  Select the best answer to the question for your operation."]
[]
["Landowner Name:",null,"Gaskin",null,"Farm:","WUC",null,"Field No.:",3]
[]
{"$rows_left_out":66}
{"sheet":"Cover Crop Data","index":1,"n_rows":71,"n_cols":32,"rows_kept":71,"cut":false,"hidden":false,"merged":[[47,14,47,17],[19,6,19,7],[54,0,54,1],[47,0,47,1],[70,0,70,11],[53,0,53,1],[20,6,20,7],[21,6,21,7],[22,6,22,7]]}
["Growing Period","Use before Legume","Tolerant of Poor Drainage","Rice","Min pH","Max pH","1st Problem","2nd Problem","1st Benefit","2nd Benefit","Total","Species/Rating","Compaction reduction","Residue Persistence","Erosion Control","Weed Control","Nematode Control","Attract Beneficials","Provide N","Nitrogen Scavenger","P&K scavenger","Tolerant of Poor Drainage (0-4 scale)","Recommended for rice","Forage Quality","Perennial","Seed Size","pH range low","pH range high","Funtional Group","Growing Period","Drill seeding Rate","Broadcast seeding rate"]
[{"$f":"IF(AND('Finding the Right Cover Crop'!$D$45=\"cool season\",AD2=\"cool season\"),1,IF(AND('Finding the Right Cover Crop'!$D$45=\"warm season\",AD2=\"warm season\"),1,IF(AND('Finding the Right Cover Crop'!$D$45=\"No full season cover crop possible with this combination.  It may be possible to use a warm season cover crop species or variety with a short maturity window.\",AD2=\"warm season\"),1,\"\")))","v":""},{"$f":"IF(AND('Finding the Right Cover Crop'!$D$46=\"Because next cash crop is a legume and you did not specify you wanted to plant a CC mixture, a legume CC is not recommended.\",'Cover Crop Data'!AC3=\"L\"),\"\",1)","v":1},{"$f":"IF(AND('Finding the Right Cover Crop'!$F$32=\"Yes\",'Cover Crop Data'!V2>0),V2,IF(OR('Finding the Right Cover Crop'!$F$32=\"no\",'Finding the Right Cover Crop'!$F$32=\"\",'Cover Crop Data'!D2>0),0,\"\"))","v":0},{"$f":"IF(AND('Finding the Right Cover Crop'!$F$14=\"rice\",'Cover Crop Data'!W2>0),W2,IF(OR('Finding the Right Cover Crop'!$F$14=\"corn\",'Finding the Right Cover Crop'!$F$14=\"cotton\",'Finding the Right Cover Crop'!$F$14=\"soybeans\",'Finding the Right Cover Crop'!$F$14=\"peanuts\",'Finding the Right Cover Crop'!$F$14=\"sweet corn\",'Finding the Right Cover Crop'!$F$14=\"sweet potatoes\",'Finding the Right Cover Crop'!$F$14=\"small grains (wheat, oats, rye)\"),0,\"\"))","v":0},null,null,{"$f":"IF('Finding the Right Cover Crop'!$F$22='Cover Crop Data'!$A$49,$M2+$N2,IF('Finding the Right Cover Crop'!$F$22='Cover Crop Data'!$A$50,$M2+$N2,IF('Finding the Right Cover Crop'!$F$22='Cover Crop Data'!$A$51,$N2+$P2,IF('Finding the Right Cover Crop'!$F$22='Cover Crop Data'!$A$52,$Q2,IF('Finding the Right Cover Crop'!$F$22='Cover Crop Data'!$A$53,$N2+$O2,IF('Finding the Right Cover Crop'!$F$22=\"Low N\",$S2,IF(AND('Finding the Right Cover Crop'!$F$22=\"Low N\",'Finding the Right Cover Crop'!$F$28=\"yes\"),$S2,\"\")))))))","v":0},{"$f":"IF('Finding the Right Cover Crop'!$F$24='Cover Crop Data'!$A$49,$M2+$N2,IF('Finding the Right Cover Crop'!$F$24='Cover Crop Data'!$A$50,$M2+$N2,IF('Finding the Right Cover Crop'!$F$24='Cover Crop Data'!$A$51,$N2+$P2,IF('Finding the Right Cover Crop'!$F$24='Cover Crop Data'!$A$52,$Q2,IF('Finding the Right Cover Crop'!$F$24='Cover Crop Data'!$A$53,$N2+$O2,IF(AND('Finding the Right Cover Crop'!$F$24=\"Low N\",'Finding the Right Cover Crop'!$F$28=\"no\",$S2=0),\"\",IF(AND('Finding the Right Cover Crop'!$F$24=\"low N\",'Finding the Right Cover Crop'!$F$28=\"no\",'Cover Crop Data'!$S2>0),'Cover Crop Data'!$S2,IF(AND('Finding the Right Cover Crop'!$F$24=\"Low N\",'Finding the Right Cover Crop'!$F$28=\"yes\"),$S2,0))))))))","v":1},{"$f":"IF(AND('Finding the Right Cover Crop'!$F$26=\"provide N\",OR('Finding the Right Cover Crop'!$F$28=\"no\",'Finding the Right Cover Crop'!$F$28=\"\"),'Cover Crop Data'!AC2=\"L\"),1,IF(AND('Finding the Right Cover Crop'!$F$26=\"provide N\",'Finding the Right Cover Crop'!$F$28=\"yes\",OR('Cover Crop Data'!AC2=\"F\",'Cover Crop Data'!AC2=\"L\",'Cover Crop Data'!AC2=\"G\")),1,IF(AND('Finding the Right Cover Crop'!$F$26=\"scavenge N\"),'Cover Crop Data'!T2,IF('Finding the Right Cover Crop'!$F$26=\"scavenge P and K\",'Cover Crop Data'!U2,IF('Finding the Right Cover Crop'!$F$26=\"attract beneficials\",'Cover Crop Data'!R2,IF('Finding the Right Cover Crop'!$F$26=\"high forage quality\",'Cover Crop Data'!X2,0))))))","v":1},null,{"$f":"IF(OR(A2=\"\",B2=\"\",C2=\"\",D2=\"\",G2=\"\",H2=\"\",I2=\"\"),\"\",SUM(G2:J2))","v":""},"Buckwheat",1,0,1,4,1,4,0,0,4,1,3,0,"N",null,5,7,"F","Warm Season"]
[{"$f":"IF(AND('Finding the Right Cover Crop'!$D$45=\"cool season\",AD3=\"cool season\"),1,IF(AND('Finding the Right Cover Crop'!$D$45=\"warm season\",AD3=\"warm season\"),1,IF(AND('Finding the Right Cover Crop'!$D$45=\"No full season cover crop possible with this combination.  It may be possible to use a warm season cover crop species or variety with a short maturity window.\",AD3=\"warm season\"),1,\"\")))","v":1},{"$f":"IF(AND('Finding the Right Cover Crop'!$D$46=\"Because next cash crop is a legume and you did not specify you wanted to plant a CC mixture, a legume CC is not recommended.\",'Cover Crop Data'!AC4=\"L\"),\"\",1)","v":1},{"$f":"IF(AND('Finding the Right Cover Crop'!$F$32=\"Yes\",'Cover Crop Data'!V3>0),V3,IF(OR('Finding the Right Cover Crop'!$F$32=\"no\",'Finding the Right Cover Crop'!$F$32=\"\",'Cover Crop Data'!D3>0),0,\"\"))","v":0},{"$f":"IF(AND('Finding the Right Cover Crop'!$F$14=\"rice\",'Cover Crop Data'!W3>0),W3,IF(OR('Finding the Right Cover Crop'!$F$14=\"corn\",'Finding the Right Cover Crop'!$F$14=\"cotton\",'Finding the Right Cover Crop'!$F$14=\"soybeans\",'Finding the Right Cover Crop'!$F$14=\"peanuts\",'Finding the Right Cover Crop'!$F$14=\"sweet corn\",'Finding the Right Cover Crop'!$F$14=\"sweet potatoes\",'Finding the Right Cover Crop'!$F$14=\"small grains (wheat, oats, rye)\"),0,\"\"))","v":0},null,null,{"$f":"IF('Finding the Right Cover Crop'!$F$22='Cover Crop Data'!$A$49,$M3+$N3,IF('Finding the Right Cover Crop'!$F$22='Cover Crop Data'!$A$50,$M3+$N3,IF('Finding the Right Cover Crop'!$F$22='Cover Crop Data'!$A$51,$N3+$P3,IF('Finding the Right Cover Crop'!$F$22='Cover Crop Data'!$A$52,$Q3,IF('Finding the Right Cover Crop'!$F$22='Cover Crop Data'!$A$53,$N3+$O3,IF('Finding the Right Cover Crop'!$F$22=\"Low N\",$S3,IF(AND('Finding the Right Cover Crop'!$F$22=\"Low N\",'Finding the Right Cover Crop'!$F$28=\"yes\"),$S3,\"\")))))))","v":0},{"$f":"IF('Finding the Right Cover Crop'!$F$24='Cover Crop Data'!$A$49,$M3+$N3,IF('Finding the Right Cover Crop'!$F$24='Cover Crop Data'!$A$50,$M3+$N3,IF('Finding the Right Cover Crop'!$F$24='Cover Crop Data'!$A$51,$N3+$P3,IF('Finding the Right Cover Crop'!$F$24='Cover Crop Data'!$A$52,$Q3,IF('Finding the Right Cover Crop'!$F$24='Cover Crop Data'!$A$53,$N3+$O3,IF(AND('Finding the Right Cover Crop'!$F$24=\"Low N\",'Finding the Right Cover Crop'!$F$28=\"no\",$S3=0),\"\",IF(AND('Finding the Right Cover Crop'!$F$24=\"low N\",'Finding the Right Cover Crop'!$F$28=\"no\",'Cover Crop Data'!$S3>0),'Cover Crop Data'!$S3,IF(AND('Finding the Right Cover Crop'!$F$24=\"Low N\",'Finding the Right Cover Crop'!$F$28=\"yes\"),$S3,0))))))))","v":3},{"$f":"IF(AND('Finding the Right Cover Crop'!$F$26=\"provide N\",OR('Finding the Right Cover Crop'!$F$28=\"no\",'Finding the Right Cover Crop'!$F$28=\"\"),'Cover Crop Data'!AC3=\"L\"),1,IF(AND('Finding the Right Cover Crop'!$F$26=\"provide N\",'Finding the Right Cover Crop'!$F$28=\"yes\",OR('Cover Crop Data'!AC3=\"F\",'Cover Crop Data'!AC3=\"L\",'Cover Crop Data'!AC3=\"G\")),1,IF(AND('Finding the Right Cover Crop'!$F$26=\"scavenge N\"),'Cover Crop Data'!T3,IF('Finding the Right Cover Crop'!$F$26=\"scavenge P and K\",'Cover Crop Data'!U3,IF('Finding the Right Cover Crop'!$F$26=\"attract beneficials\",'Cover Crop Data'!R3,IF('Finding the Right Cover Crop'!$F$26=\"high forage quality\",'Cover Crop Data'!X3,0))))))","v":1},null,{"$f":"IF(OR(A3=\"\",B3=\"\",C3=\"\",D3=\"\",G3=\"\",H3=\"\",I3=\"\"),\"\",SUM(G3:J3))","v":4},"Mustards",2,1,3,3,3,2,0,2,3,1,null,2,"N","s",5.5,6.8,"F","Cool Season"]
[{"$f":"IF(AND('Finding the Right Cover Crop'!$D$45=\"cool season\",AD4=\"cool season\"),1,IF(AND('Finding the Right Cover Crop'!$D$45=\"warm season\",AD4=\"warm season\"),1,IF(AND('Finding the Right Cover Crop'!$D$45=\"No full season cover crop possible with this combination.  It may be possible to use a warm season cover crop species or variety with a short maturity window.\",AD4=\"warm season\"),1,\"\")))","v":1},{"$f":"IF(AND('Finding the Right Cover Crop'!$D$46=\"Because next cash crop is a legume and you did not specify you wanted to plant a CC mixture, a legume CC is not recommended.\",'Cover Crop Data'!AC5=\"L\"),\"\",1)","v":1},{"$f":"IF(AND('Finding the Right Cover Crop'!$F$32=\"Yes\",'Cover Crop Data'!V4>0),V4,IF(OR('Finding the Right Cover Crop'!$F$32=\"no\",'Finding the Right Cover Crop'!$F$32=\"\",'Cover Crop Data'!D4>0),0,\"\"))","v":0},{"$f":"IF(AND('Finding the Right Cover Crop'!$F$14=\"rice\",'Cover Crop Data'!W4>0),W4,IF(OR('Finding the Right Cover Crop'!$F$14=\"corn\",'Finding the Right Cover Crop'!$F$14=\"cotton\",'Finding the Right Cover Crop'!$F$14=\"soybeans\",'Finding the Right Cover Crop'!$F$14=\"peanuts\",'Finding the Right Cover Crop'!$F$14=\"sweet corn\",'Finding the Right Cover Crop'!$F$14=\"sweet potatoes\",'Finding the Right Cover Crop'!$F$14=\"small grains (wheat, oats, rye)\"),0,\"\"))","v":0},null,null,{"$f":"IF('Finding the Right Cover Crop'!$F$22='Cover Crop Data'!$A$49,$M4+$N4,IF('Finding the Right Cover Crop'!$F$22='Cover Crop Data'!$A$50,$M4+$N4,IF('Finding the Right Cover Crop'!$F$22='Cover Crop Data'!$A$51,$N4+$P4,IF('Finding the Right Cover Crop'!$F$22='Cover Crop Data'!$A$52,$Q4,IF('Finding the Right Cover Crop'!$F$22='Cover Crop Data'!$A$53,$N4+$O4,IF('Finding the Right Cover Crop'!$F$22=\"Low N\",$S4,IF(AND('Finding the Right Cover Crop'!$F$22=\"Low N\",'Finding the Right Cover Crop'!$F$28=\"yes\"),$S4,\"\")))))))","v":0},{"$f":"IF('Finding the Right Cover Crop'!$F$24='Cover Crop Data'!$A$49,$M4+$N4,IF('Finding the Right Cover Crop'!$F$24='Cover Crop Data'!$A$50,$M4+$N4,IF('Finding the Right Cover Crop'!$F$24='Cover Crop Data'!$A$51,$N4+$P4,IF('Finding the Right Cover Crop'!$F$24='Cover Crop Data'!$A$52,$Q4,IF('Finding the Right Cover Crop'!$F$24='Cover Crop Data'!$A$53,$N4+$O4,IF(AND('Finding the Right Cover Crop'!$F$24=\"Low N\",'Finding the Right Cover Crop'!$F$28=\"no\",$S4=0),\"\",IF(AND('Finding the Right Cover Crop'!$F$24=\"low N\",'Finding the Right Cover Crop'!$F$28=\"no\",'Cover Crop Data'!$S4>0),'Cover Crop Data'!$S4,IF(AND('Finding the Right Cover Crop'!$F$24=\"Low N\",'Finding the Right Cover Crop'!$F$28=\"yes\"),$S4,0))))))))","v":4},{"$f":"IF(AND('Finding the Right Cover Crop'!$F$26=\"provide N\",OR('Finding the Right Cover Crop'!$F$28=\"no\",'Finding the Right Cover Crop'!$F$28=\"\"),'Cover Crop Data'!AC4=\"L\"),1,IF(AND('Finding the Right Cover Crop'!$F$26=\"provide N\",'Finding the Right Cover Crop'!$F$28=\"yes\",OR('Cover Crop Data'!AC4=\"F\",'Cover Crop Data'!AC4=\"L\",'Cover Crop Data'!AC4=\"G\")),1,IF(AND('Finding the Right Cover Crop'!$F$26=\"scavenge N\"),'Cover Crop Data'!T4,IF('Finding the Right Cover Crop'!$F$26=\"scavenge P and K\",'Cover Crop Data'!U4,IF('Finding the Right Cover Crop'!$F$26=\"attract beneficials\",'Cover Crop Data'!R4,IF('Finding the Right Cover Crop'!$F$26=\"high forage quality\",'Cover Crop Data'!X4,0))))))","v":1},null,5,"Radish",3,1,3,4,3,1,0,4,3,1,2,2,"N","s",5.8,6.8,"F","Cool Season"]
[{"$f":"IF(AND('Finding the Right Cover Crop'!$D$45=\"cool season\",AD5=\"cool season\"),1,IF(AND('Finding the Right Cover Crop'!$D$45=\"warm season\",AD5=\"warm season\"),1,IF(AND('Finding the Right Cover Crop'!$D$45=\"No full season cover crop possible with this combination.  It may be possible to use a warm season cover crop species or variety with a short maturity window.\",AD5=\"warm season\"),1,\"\")))","v":1},{"$f":"IF(AND('Finding the Right Cover Crop'!$D$46=\"Because next cash crop is a legume and you did not specify you wanted to plant a CC mixture, a legume CC is not recommended.\",'Cover Crop Data'!AC6=\"L\"),\"\",1)","v":1},{"$f":"IF(AND('Finding the Right Cover Crop'!$F$32=\"Yes\",'Cover Crop Data'!V5>0),V5,IF(OR('Finding the Right Cover Crop'!$F$32=\"no\",'Finding the Right Cover Crop'!$F$32=\"\",'Cover Crop Data'!D5>0),0,\"\"))","v":0},{"$f":"IF(AND('Finding the Right Cover Crop'!$F$14=\"rice\",'Cover Crop Data'!W5>0),W5,IF(OR('Finding the Right Cover Crop'!$F$14=\"corn\",'Finding the Right Cover Crop'!$F$14=\"cotton\",'Finding the Right Cover Crop'!$F$14=\"soybeans\",'Finding the Right Cover Crop'!$F$14=\"peanuts\",'Finding the Right Cover Crop'!$F$14=\"sweet corn\",'Finding the Right Cover Crop'!$F$14=\"sweet potatoes\",'Finding the Right Cover Crop'!$F$14=\"small grains (wheat, oats, rye)\"),0,\"\"))","v":0},null,null,{"$f":"IF('Finding the Right Cover Crop'!$F$22='Cover Crop Data'!$A$49,$M5+$N5,IF('Finding the Right Cover Crop'!$F$22='Cover Crop Data'!$A$50,$M5+$N5,IF('Finding the Right Cover Crop'!$F$22='Cover Crop Data'!$A$51,$N5+$P5,IF('Finding the Right Cover Crop'!$F$22='Cover Crop Data'!$A$52,$Q5,IF('Finding the Right Cover Crop'!$F$22='Cover Crop Data'!$A$53,$N5+$O5,IF('Finding the Right Cover Crop'!$F$22=\"Low N\",$S5,IF(AND('Finding the Right Cover Crop'!$F$22=\"Low N\",'Finding the Right Cover Crop'!$F$28=\"yes\"),$S5,\"\")))))))","v":0},{"$f":"IF('Finding the Right Cover Crop'!$F$24='Cover Crop Data'!$A$49,$M5+$N5,IF('Finding the Right Cover Crop'!$F$24='Cover Crop Data'!$A$50,$M5+$N5,IF('Finding the Right Cover Crop'!$F$24='Cover Crop Data'!$A$51,$N5+$P5,IF('Finding the Right Cover Crop'!$F$24='Cover Crop Data'!$A$52,$Q5,IF('Finding the Right Cover Crop'!$F$24='Cover Crop Data'!$A$53,$N5+$O5,IF(AND('Finding the Right Cover Crop'!$F$24=\"Low N\",'Finding the Right Cover Crop'!$F$28=\"no\",$S5=0),\"\",IF(AND('Finding the Right Cover Crop'!$F$24=\"low N\",'Finding the Right Cover Crop'!$F$28=\"no\",'Cover Crop Data'!$S5>0),'Cover Crop Data'!$S5,IF(AND('Finding the Right Cover Crop'!$F$24=\"Low N\",'Finding the Right Cover Crop'!$F$28=\"yes\"),$S5,0))))))))","v":4},{"$f":"IF(AND('Finding the Right Cover Crop'!$F$26=\"provide N\",OR('Finding the Right Cover Crop'!$F$28=\"no\",'Finding the Right Cover Crop'!$F$28=\"\"),'Cover Crop Data'!AC5=\"L\"),1,IF(AND('Finding the Right Cover Crop'!$F$26=\"provide N\",'Finding the Right Cover Crop'!$F$28=\"yes\",OR('Cover Crop Data'!AC5=\"F\",'Cover Crop Data'!AC5=\"L\",'Cover Crop Data'!AC5=\"G\")),1,IF(AND('Finding the Right Cover Crop'!$F$26=\"scavenge N\"),'Cover Crop Data'!T5,IF('Finding the Right Cover Crop'!$F$26=\"scavenge P and K\",'Cover Crop Data'!U5,IF('Finding the Right Cover Crop'!$F$26=\"attract beneficials\",'Cover Crop Data'!R5,IF('Finding the Right Cover Crop'!$F$26=\"high forage quality\",'Cover Crop Data'!X5,0))))))","v":1},null,5,"Rapeseed",2,2,3,3,3,2,0,3,1,1,null,2,"N","s",5.5,7,"F","Cool Season"]
[{"$f":"IF(AND('Finding the Right Cover Crop'!$D$45=\"cool season\",AD6=\"cool season\"),1,IF(AND('Finding the Right Cover Crop'!$D$45=\"warm season\",AD6=\"warm season\"),1,IF(AND('Finding the Right Cover Crop'!$D$45=\"No full season cover crop possible with this combination.  It may be possible to use a warm season cover crop species or variety with a short maturity window.\",AD6=\"warm season\"),1,\"\")))","v":1},{"$f":"IF(AND('Finding the Right Cover Crop'!$D$46=\"Because next cash crop is a legume and you did not specify you wanted to plant a CC mixture, a legume CC is not recommended.\",'Cover Crop Data'!AC7=\"L\"),\"\",1)","v":1},{"$f":"IF(AND('Finding the Right Cover Crop'!$F$32=\"Yes\",'Cover Crop Data'!V6>0),V6,IF(OR('Finding the Right Cover Crop'!$F$32=\"no\",'Finding the Right Cover Crop'!$F$32=\"\",'Cover Crop Data'!D6>0),0,\"\"))","v":0},{"$f":"IF(AND('Finding the Right Cover Crop'!$F$14=\"rice\",'Cover Crop Data'!W6>0),W6,IF(OR('Finding the Right Cover Crop'!$F$14=\"corn\",'Finding the Right Cover Crop'!$F$14=\"cotton\",'Finding the Right Cover Crop'!$F$14=\"soybeans\",'Finding the Right Cover Crop'!$F$14=\"peanuts\",'Finding the Right Cover Crop'!$F$14=\"sweet corn\",'Finding the Right Cover Crop'!$F$14=\"sweet potatoes\",'Finding the Right Cover Crop'!$F$14=\"small grains (wheat, oats, rye)\"),0,\"\"))","v":0},null,null,{"$f":"IF('Finding the Right Cover Crop'!$F$22='Cover Crop Data'!$A$49,$M6+$N6,IF('Finding the Right Cover Crop'!$F$22='Cover Crop Data'!$A$50,$M6+$N6,IF('Finding the Right Cover Crop'!$F$22='Cover Crop Data'!$A$51,$N6+$P6,IF('Finding the Right Cover Crop'!$F$22='Cover Crop Data'!$A$52,$Q6,IF('Finding the Right Cover Crop'!$F$22='Cover Crop Data'!$A$53,$N6+$O6,IF('Finding the Right Cover Crop'!$F$22=\"Low N\",$S6,IF(AND('Finding the Right Cover Crop'!$F$22=\"Low N\",'Finding the Right Cover Crop'!$F$28=\"yes\"),$S6,\"\")))))))","v":0},{"$f":"IF('Finding the Right Cover Crop'!$F$24='Cover Crop Data'!$A$49,$M6+$N6,IF('Finding the Right Cover Crop'!$F$24='Cover Crop Data'!$A$50,$M6+$N6,IF('Finding the Right Cover Crop'!$F$24='Cover Crop Data'!$A$51,$N6+$P6,IF('Finding the Right Cover Crop'!$F$24='Cover Crop Data'!$A$52,$Q6,IF('Finding the Right Cover Crop'!$F$24='Cover Crop Data'!$A$53,$N6+$O6,IF(AND('Finding the Right Cover Crop'!$F$24=\"Low N\",'Finding the Right Cover Crop'!$F$28=\"no\",$S6=0),\"\",IF(AND('Finding the Right Cover Crop'!$F$24=\"low N\",'Finding the Right Cover Crop'!$F$28=\"no\",'Cover Crop Data'!$S6>0),'Cover Crop Data'!$S6,IF(AND('Finding the Right Cover Crop'!$F$24=\"Low N\",'Finding the Right Cover Crop'!$F$28=\"yes\"),$S6,0))))))))","v":3},{"$f":"IF(AND('Finding the Right Cover Crop'!$F$26=\"provide N\",OR('Finding the Right Cover Crop'!$F$28=\"no\",'Finding the Right Cover Crop'!$F$28=\"\"),'Cover Crop Data'!AC6=\"L\"),1,IF(AND('Finding the Right Cover Crop'!$F$26=\"provide N\",'Finding the Right Cover Crop'!$F$28=\"yes\",OR('Cover Crop Data'!AC6=\"F\",'Cover Crop Data'!AC6=\"L\",'Cover Crop Data'!AC6=\"G\")),1,IF(AND('Finding the Right Cover Crop'!$F$26=\"scavenge N\"),'Cover Crop Data'!T6,IF('Finding the Right Cover Crop'!$F$26=\"scavenge P and K\",'Cover Crop Data'!U6,IF('Finding the Right Cover Crop'!$F$26=\"attract beneficials\",'Cover Crop Data'!R6,IF('Finding the Right Cover Crop'!$F$26=\"high forage quality\",'Cover Crop Data'!X6,0))))))","v":1},null,4,"Black Oats",1,2,3,4,4,0,0,3,1,2,null,2,"N",null,4.5,6.5,"G","Cool Season"]
{"$rows_left_out":66}
{"sheet":"Reference Links","index":2,"n_rows":55,"n_cols":18,"rows_kept":55,"cut":false,"hidden":false,"merged":[]}
[]
["Drop Down Lists"]
[null,"DRILL","CROP","Month","TILLAGE","PROBLEMS",null,null,null,null,null,null,null,null,"BENEFITS",null,null,"pH"]
[null,"Yes","corn","Jan","no-till/strip till","Soil compaction/lack of quick water infiltration",null,null,null,null,null,null,null,null,"Provide N",null,null,"<5"]
[null,"No","cotton","Feb","conventional","Low soil organic matter/moisture and nutrient retention/herbicide efficacy",null,null,null,null,null,null,null,null,"Scavenge N",null,null,"5 to 6"]
[null,null,"grain sorghum","Mar",null,"Weeds",null,null,null,null,null,null,null,null,"Scavenge P and K",null,null,"6 to 7"]
{"$rows_left_out":50}
{"sheet":"Sheet3","index":3,"n_rows":17,"n_cols":8,"rows_kept":17,"cut":false,"hidden":false,"merged":[]}
[]
[]
[]
[]
[]
[]
{"$rows_left_out":11}